Information card for entry 8104101
Formula |
Al Co2 Pr2 |
Calculated formula |
Al Co2 Pr2 |
Title of publication |
Structure and transport properties of the R2 Co2 Al compounds (R= Pr, Nd, Sm, Gd, Tb, Dy, Ho, Er, Tm, Y) |
Authors of publication |
Pani, M.; Merlo, F.; Fornasini, M.L. |
Journal of publication |
Zeitschrift fuer Kristallographie (149,1979-) |
Year of publication |
2002 |
Journal volume |
217 |
Pages of publication |
415 - 419 |
a |
4.1592 Å |
b |
5.573 Å |
c |
8.74 Å |
α |
90° |
β |
90° |
γ |
90° |
Cell volume |
202.586 Å3 |
Number of distinct elements |
3 |
Space group number |
71 |
Hermann-Mauguin space group symbol |
I m m m |
Hall space group symbol |
-I 2 2 |
Yes |
No |
No |