Information card for entry 8104753
Common name | 2,4-dicyclohexyliminepentane |
Chemical name | 2,4-dicyclohexyliminepentane |
Formula | C17 H30 N2 |
Calculated formula | C17 H30 N2 |
Title of publication | The crystal structure of N-(4-(cyclohexylimino)pent-2-en-2-yl)cyclohexanamine, C17H30N2 |
Authors of publication | Hosten, Eric C.; Betz, Richard |
Journal of publication | Zeitschrift für Kristallographie - New Crystal Structures |
Year of publication | 2021 |
Journal volume | 236 |
Journal issue | 3 |
Pages of publication | 515 - 517 |
a | 8.6755 ± 0.0003 Å |
b | 8.6755 ± 0.0003 Å |
c | 11.1611 ± 0.0004 Å |
α | 90° |
β | 90° |
γ | 90° |
Cell volume | 840.03 ± 0.05 Å3 |
Cell temperature | 296 ± 2 K |
Ambient diffraction temperature | 296 ± 2 K |
Number of distinct elements | 3 |
Space group number | 113 |
Hermann-Mauguin space group symbol | P -4 21 m |
Hall space group symbol | P -4 2ab |
Residual factor for all reflections | 0.0531 |
Residual factor for significantly intense reflections | 0.0488 |
Weighted residual factors for significantly intense reflections | 0.1367 |
Weighted residual factors for all reflections included in the refinement | 0.1417 |
Goodness-of-fit parameter for all reflections included in the refinement | 1.073 |
Diffraction radiation wavelength | 0.71073 Å |
Diffraction radiation type | MoKα |