Information card for entry 8106223
Formula | C31 H35 Ag2 N4 O9 |
Calculated formula | C31 H35 Ag2 N4 O9 |
Title of publication | Crystal structure of bis{catena-poly[(μ2-1,2-bis(4-pyridyl)ethane-κ2 N:N′)silver(I)]} diaqua-bis(5-(4-carboxyphenyl)pyridine-2-carboxylato-κ2 N,O)-(μ2-1,2-bis(4-pyridyl)ethane-κ2 N:N′)disilver(I) octahydrate, C31H35Ag2N4O9 |
Authors of publication | Fan, Hui-Tao; Ding, Jie; Xie, Jing-Peng; Wang, Kun |
Journal of publication | Zeitschrift für Kristallographie - New Crystal Structures |
Year of publication | 2018 |
Journal volume | 233 |
Journal issue | 4 |
Pages of publication | 585 - 587 |
a | 8.8351 ± 0.0005 Å |
b | 13.1492 ± 0.0006 Å |
c | 14.7094 ± 0.0008 Å |
α | 85.491 ± 0.004° |
β | 84.285 ± 0.005° |
γ | 72.413 ± 0.004° |
Cell volume | 1618.76 ± 0.15 Å3 |
Cell temperature | 293 ± 2 K |
Ambient diffraction temperature | 293 ± 2 K |
Number of distinct elements | 5 |
Space group number | 2 |
Hermann-Mauguin space group symbol | P -1 |
Hall space group symbol | -P 1 |
Residual factor for all reflections | 0.0526 |
Residual factor for significantly intense reflections | 0.0382 |
Weighted residual factors for significantly intense reflections | 0.074 |
Weighted residual factors for all reflections included in the refinement | 0.0796 |
Goodness-of-fit parameter for all reflections included in the refinement | 1.009 |
Diffraction radiation wavelength | 0.71073 Å |
Diffraction radiation type | MoKα |