Information card for entry 8106238
Formula | C29 H17 Co N3 O5 |
Calculated formula | C29 H17 Co N3 O5 |
Title of publication | Crystal structure of poly[μ3-5-(4-(2,6-di(pyridine-2-yl)pyridine-4-yl)phenoxy)isophthalato-κ6 O:O′,O′′:N,N′,N′′)cobalt(II)] C29H17CoN3O5 |
Authors of publication | Liu, Xue-Guo; Yan, Wei-Hong; Xing, Xiao-Jing; Fan, Hui-Tao |
Journal of publication | Zeitschrift für Kristallographie - New Crystal Structures |
Year of publication | 2018 |
Journal volume | 233 |
Journal issue | 4 |
Pages of publication | 629 - 630 |
a | 7.7751 ± 0.0006 Å |
b | 12.8081 ± 0.0014 Å |
c | 12.4032 ± 0.0015 Å |
α | 90° |
β | 103.79 ± 0.01° |
γ | 90° |
Cell volume | 1199.6 ± 0.2 Å3 |
Cell temperature | 293 ± 2 K |
Ambient diffraction temperature | 293 ± 2 K |
Number of distinct elements | 5 |
Space group number | 4 |
Hermann-Mauguin space group symbol | P 1 21 1 |
Hall space group symbol | P 2yb |
Residual factor for all reflections | 0.1047 |
Residual factor for significantly intense reflections | 0.0627 |
Weighted residual factors for significantly intense reflections | 0.0814 |
Weighted residual factors for all reflections included in the refinement | 0.094 |
Goodness-of-fit parameter for all reflections included in the refinement | 0.967 |
Diffraction radiation wavelength | 0.71073 Å |
Diffraction radiation type | MoKα |