Information card for entry 8106290
Formula | C9 H4 Ag2 O6 |
Calculated formula | C9 H4 Ag2 O6 |
Title of publication | Crystal structure of poly[μ8-3-carboxyphthalat-κ8-O:O 1,O 1,O 1:O 2:O 3,O 3:O 4)silver(I)], C9H4Ag2O6 |
Authors of publication | Liu, Xue-Guo; Yan, Wei-Hong; Xing, Xiao-Jing; Fan, Hui-Tao; Shi, Zhen-Zhen |
Journal of publication | Zeitschrift für Kristallographie - New Crystal Structures |
Year of publication | 2018 |
Journal volume | 233 |
Journal issue | 5 |
Pages of publication | 771 - 772 |
a | 13.8224 ± 0.0006 Å |
b | 9.5222 ± 0.0004 Å |
c | 7.2104 ± 0.0003 Å |
α | 90° |
β | 101.991 ± 0.004° |
γ | 90° |
Cell volume | 928.32 ± 0.07 Å3 |
Cell temperature | 293 ± 2 K |
Ambient diffraction temperature | 293 ± 2 K |
Number of distinct elements | 4 |
Space group number | 14 |
Hermann-Mauguin space group symbol | P 1 21/c 1 |
Hall space group symbol | -P 2ybc |
Residual factor for all reflections | 0.0383 |
Residual factor for significantly intense reflections | 0.0239 |
Weighted residual factors for significantly intense reflections | 0.0396 |
Weighted residual factors for all reflections included in the refinement | 0.0411 |
Goodness-of-fit parameter for all reflections included in the refinement | 1.006 |
Diffraction radiation wavelength | 0.71073 Å |
Diffraction radiation type | MoKα |