Information card for entry 8106292
Formula | C16 H16 N2 O3 |
Calculated formula | C16 H16 N2 O3 |
Title of publication | Crystal structure of (E)-1-(4-(((E)-2-hydroxy-3-methoxybenzylidene)amino)phenyl)ethan-1-one oxime, C16H16N2O3 |
Authors of publication | Li, Peng-Peng; Ma, Jin-Xia; Li, Qing-Lin; Zhao, Ji-Xing; Zhao, Li |
Journal of publication | Zeitschrift für Kristallographie - New Crystal Structures |
Year of publication | 2018 |
Journal volume | 233 |
Journal issue | 5 |
Pages of publication | 777 - 778 |
a | 12.929 ± 0.013 Å |
b | 11.966 ± 0.012 Å |
c | 9.742 ± 0.009 Å |
α | 90° |
β | 107.449 ± 0.019° |
γ | 90° |
Cell volume | 1438 ± 2 Å3 |
Cell temperature | 296 ± 2 K |
Ambient diffraction temperature | 296 ± 2 K |
Number of distinct elements | 4 |
Space group number | 14 |
Hermann-Mauguin space group symbol | P 1 21/c 1 |
Hall space group symbol | -P 2ybc |
Residual factor for all reflections | 0.071 |
Residual factor for significantly intense reflections | 0.0515 |
Weighted residual factors for significantly intense reflections | 0.1587 |
Weighted residual factors for all reflections included in the refinement | 0.1767 |
Goodness-of-fit parameter for all reflections included in the refinement | 1.061 |
Diffraction radiation wavelength | 0.71073 Å |
Diffraction radiation type | MoKα |