Information card for entry 8107130
Formula | C26 H18 F7 N S |
Calculated formula | C26 H18 F7 N S |
Title of publication | Structure and photochromism of 1-(1,2-dimethylindol-3-yl)-2-[2-methyl-5-(3-fluorophenyl)-3-thienyl]-3,3,4,4,5,5-hexafluorocyclopent-1-ene, C26H18F7NS |
Authors of publication | Zheng, Chunhong; Feng, Erting; Fan, Congbin; Pu, Shouzhi |
Journal of publication | Zeitschrift für Kristallographie - New Crystal Structures |
Year of publication | 2016 |
Journal volume | 231 |
Journal issue | 4 |
Pages of publication | 1159 - 1161 |
a | 8.492 ± 0.018 Å |
b | 11.23 ± 0.02 Å |
c | 14.75 ± 0.03 Å |
α | 68.93 ± 0.02° |
β | 74.9 ± 0.02° |
γ | 68.35 ± 0.02° |
Cell volume | 1207 ± 4 Å3 |
Cell temperature | 296 ± 2 K |
Ambient diffraction temperature | 296 ± 2 K |
Number of distinct elements | 5 |
Space group number | 2 |
Hermann-Mauguin space group symbol | P -1 |
Hall space group symbol | -P 1 |
Residual factor for all reflections | 0.0664 |
Residual factor for significantly intense reflections | 0.0511 |
Weighted residual factors for significantly intense reflections | 0.1511 |
Weighted residual factors for all reflections included in the refinement | 0.1643 |
Goodness-of-fit parameter for all reflections included in the refinement | 1.046 |
Diffraction radiation wavelength | 0.71073 Å |
Diffraction radiation type | MoKα |