Information card for entry 9002583
Mineral name |
Ronneburgite |
Formula |
K2 Mn O12 V4 |
Calculated formula |
K2 Mn O12 V4 |
Title of publication |
Ronneburgite, K2MnV4O12, a new mineral from Ronneburg, Thuringia, Germany: Description and crystal structure |
Authors of publication |
Witzke, T.; Zhen, S.; Seff, K.; Doering, T.; Nasdala, L.; Kolitsch, U. |
Journal of publication |
American Mineralogist |
Year of publication |
2001 |
Journal volume |
86 |
Pages of publication |
1081 - 1086 |
a |
8.183 Å |
b |
9.247 Å |
c |
8.651 Å |
α |
90° |
β |
109.74° |
γ |
90° |
Cell volume |
616.138 Å3 |
Number of distinct elements |
4 |
Space group number |
14 |
Hermann-Mauguin space group symbol |
P 1 21/n 1 |
Hall space group symbol |
-P 2yn |
Yes |
No |
No |