Information card for entry 9004290
Mineral name |
Fernandinite |
Formula |
Ca0.72 O5 V2 |
Calculated formula |
Ca0.72 O5 V2 |
Title of publication |
The crystal structure and crystal chemistry of fernandinite and corvusite Minasragu, Peru, with general formula (Ca,Na,K)x(V,Fe,Ti)8O20.4H2O |
Authors of publication |
Evans, H. T.; Post, J. E.; Ross, D. R.; Nelen, J. A. |
Journal of publication |
The Canadian Mineralogist |
Year of publication |
1994 |
Journal volume |
32 |
Pages of publication |
339 - 351 |
a |
11.68 Å |
b |
3.6537 Å |
c |
11.023 Å |
α |
90° |
β |
105° |
γ |
90° |
Cell volume |
454.38 Å3 |
Number of distinct elements |
3 |
Space group number |
12 |
Hermann-Mauguin space group symbol |
C 1 2/m 1 |
Hall space group symbol |
-C 2y |
Yes |
No |
No |