Information card for entry 9004600
Mineral name |
Olenite |
Formula |
Al8.424 B4.062 Ca0.4 F0.06 H3.31 Li0.357 Na0.294 O30.94 Si4.854 |
Calculated formula |
Al8.424 B4.062 Ca0.4 F0.06 H3.31 Li0.357 Na0.294 O30.94 Si4.854 |
Title of publication |
Tetrahedrally coordinated boron in a tourmaline: Boron-rich olenite from Stoffhutte, Koralpe, Austria |
Authors of publication |
Hughes, J. M.; Ertl, A.; Dyar, M. D.; Grew, E. S.; Shearer, C. K.; Yates, M. G.; Guidotti, C. V. |
Journal of publication |
The Canadian Mineralogist |
Year of publication |
2000 |
Journal volume |
38 |
Pages of publication |
861 - 868 |
a |
15.731 Å |
b |
15.731 Å |
c |
7.0638 Å |
α |
90° |
β |
90° |
γ |
120° |
Cell volume |
1513.85 Å3 |
Number of distinct elements |
9 |
Space group number |
160 |
Hermann-Mauguin space group symbol |
R 3 m :H |
Hall space group symbol |
R 3 -2" |
Yes |
No |
No |