Information card for entry 9004605
Mineral name |
Meionite |
Formula |
C0.13 Al1.5 Ca0.96 O6.39 Si1.5 |
Calculated formula |
C0.13 Al1.5 Ca0.96 O6.39 Si1.5 |
Title of publication |
Meionite: Rietveld structure-refinement, Si MAS and Al SATRAS NMR spectroscopy, and comments on the marialite-meionite series Sample: S.MEI, Synthetic |
Authors of publication |
Sherriff, B. L.; Sokolova, E. V.; Kabalov, Y. K.; Jenkins, D. M.; Kunath-Fandrei G; Goetz, S.; Jager, C.; Schneider, J. |
Journal of publication |
The Canadian Mineralogist |
Year of publication |
2000 |
Journal volume |
38 |
Pages of publication |
1201 - 1213 |
a |
12.2119 Å |
b |
12.2119 Å |
c |
7.5811 Å |
α |
90° |
β |
90° |
γ |
90° |
Cell volume |
1130.57 Å3 |
Number of distinct elements |
5 |
Space group number |
87 |
Hermann-Mauguin space group symbol |
I 4/m |
Hall space group symbol |
-I 4 |
Yes |
No |
No |