Information card for entry 9005468
Mineral name |
Paganoite |
Formula |
As Bi Ni O5 |
Calculated formula |
As Bi Ni O5 |
Title of publication |
Paganoite, NiBiAsO5, a new mineral from Johanngeorgenstadt, Saxony, Germany: description and crystal structure |
Authors of publication |
Roberts, A. C.; Burns, P. C.; Gault, R. A.; Criddle, A. J.; Feinglos, M. N.; Stirling, J. A. R. |
Journal of publication |
European Journal of Mineralogy |
Year of publication |
2001 |
Journal volume |
13 |
Pages of publication |
167 - 175 |
a |
6.7127 Å |
b |
6.8293 Å |
c |
5.2345 Å |
α |
107.625° |
β |
95.409° |
γ |
111.158° |
Cell volume |
207.616 Å3 |
Number of distinct elements |
4 |
Space group number |
2 |
Hermann-Mauguin space group symbol |
P -1 |
Hall space group symbol |
-P 1 |
Yes |
No |
No |