Information card for entry 9005634
Mineral name |
Lindackerite |
Formula |
As4 Cu4.958 H18 O25.22 |
Calculated formula |
As4 Cu4.958 H22.44 O25.22 |
Title of publication |
Crystal structre of lindackerite, (Cu,Co,Ni)Cu4(AsO4)2(AsO3OH)2*9H2O from Jachymov, Czech Republic Sample: #J688 |
Authors of publication |
Hybler, J.; Ondrus, P.; CiSarova, I.; Petricek, V.; Veselovsky, F. |
Journal of publication |
European Journal of Mineralogy |
Year of publication |
2003 |
Journal volume |
15 |
Pages of publication |
1035 - 1042 |
a |
6.415 Å |
b |
8.048 Å |
c |
10.332 Å |
α |
85.41° |
β |
79.5° |
γ |
84.71° |
Cell volume |
521.164 Å3 |
Number of distinct elements |
4 |
Space group number |
2 |
Hermann-Mauguin space group symbol |
P -1 |
Hall space group symbol |
-P 1 |
Yes |
No |
No |