Information card for entry 9005674
Mineral name |
Larisaite |
Formula |
H22 K0.15 Na1.2 O38 Se4 U6 |
Calculated formula |
H22 K0.15 Na1.2 O38 Se4 U6 |
Title of publication |
Larisaite, Na(H3O)(UO2)3(SeO3)2O2*4H2O, a new uranyl selenite mineral from Repete mine, San Juan County, Utah, U.S.A. |
Authors of publication |
Chukanov, N. V.; Pushcharovsky, D. Y.; Pasero, M.; Merlino, S.; Barinova, A. V.; Mockel, S.; Pekov, I. V.; Zadov, A. E.; Dubinchuk, V. T. |
Journal of publication |
European Journal of Mineralogy |
Year of publication |
2004 |
Journal volume |
16 |
Pages of publication |
367 - 374 |
a |
6.981 Å |
b |
7.646 Å |
c |
17.249 Å |
α |
90° |
β |
90° |
γ |
90.039° |
Cell volume |
920.695 Å3 |
Number of distinct elements |
6 |
Space group number |
6 |
Hermann-Mauguin space group symbol |
P 1 1 m |
Hall space group symbol |
P -2 |
Yes |
No |
No |