Information card for entry 9005701
Mineral name |
Dumortierite |
Formula |
Al6.61 B F0.009 Fe0.02 H0.849 Mg0.12 O17.991 Si2.83 Ti0.09 |
Calculated formula |
Al6.61 B F0.009 Fe0.02 H0.849 Mg0.12 O17.991 Si2.83 Ti0.09 |
Title of publication |
Dumortierite from the Gfohl unit, Lower Austria: chemistry, structure, and infra-red spectroscopy Sample: DUM2 |
Authors of publication |
Fuchs, Y.; Ertl, A.; Hughes, J. M.; Prowatke, S.; Brandstatter, F.; Schuster, R. |
Journal of publication |
European Journal of Mineralogy |
Year of publication |
2005 |
Journal volume |
17 |
Pages of publication |
173 - 183 |
a |
4.6948 Å |
b |
11.8037 Å |
c |
20.2106 Å |
α |
90° |
β |
90° |
γ |
90° |
Cell volume |
1119.99 Å3 |
Number of distinct elements |
9 |
Space group number |
62 |
Hermann-Mauguin space group symbol |
P n m a |
Hall space group symbol |
-P 2ac 2n |
Yes |
No |
No |