Information card for entry 9009260
Mineral name |
Berborite |
Formula |
B Be2 H3 O5 |
Calculated formula |
B Be2 H3 O5 |
Title of publication |
Berborite polytypes Locality: Saga I larvikite quarry, Morje, Porgrunn, Tvelan District, Norway Sample: 2H polytype Note: anisoU's from ICSD |
Authors of publication |
Giuseppetti, G.; Mazzi, F.; Tadini, C.; Larsen, A. O.; Asheim, A.; Raade, G. |
Journal of publication |
Neues Jahrbuch fur Mineralogie, Abhandlungen |
Year of publication |
1990 |
Journal volume |
162 |
Pages of publication |
101 - 116 |
a |
4.433 Å |
b |
4.433 Å |
c |
10.638 Å |
α |
90° |
β |
90° |
γ |
120° |
Cell volume |
181.045 Å3 |
Number of distinct elements |
4 |
Hermann-Mauguin space group symbol |
P 63 |
Yes |
No |
No |