Information card for entry 9009763
Mineral name |
Wakefieldite-(Ce) |
Formula |
Ce O4 V |
Calculated formula |
Ce O4 V |
Title of publication |
Crystal structure refinements of zircon-type MVO4 (M = Sc, Y, Ce, Pr, Nd, Tb, Ho, Er, Tm, Yb, Lu) Locality: synthetic |
Authors of publication |
Chakoumakos, B. C.; Abraham, M. M.; Boatner, L. A. |
Journal of publication |
Journal of Solid State Chemistry |
Year of publication |
1994 |
Journal volume |
109 |
Pages of publication |
197 - 202 |
a |
7.4004 Å |
b |
7.4004 Å |
c |
6.4972 Å |
α |
90° |
β |
90° |
γ |
90° |
Cell volume |
355.825 Å3 |
Number of distinct elements |
3 |
Space group number |
141 |
Hermann-Mauguin space group symbol |
I 41/a m d :2 |
Hall space group symbol |
-I 4bd 2 |
Yes |
No |
No |