Information card for entry 9014505
Mineral name |
Panguite |
Formula |
O3 Ti1.67 |
Calculated formula |
O3 Ti1.67 |
Title of publication |
Panguite, (Ti4+,Sc,Al,Mg,Zr,Ca)1.8O3, a new ultra-refractory titania mineral from the Allende meteorite: Synchrotron micro-diffraction and EBSD |
Authors of publication |
Ma, C.; Tschauner, O.; Beckett, J. R.; Rossman, G. R.; Liu, W. |
Journal of publication |
American Mineralogist |
Year of publication |
2012 |
Journal volume |
97 |
Pages of publication |
1219 - 1225 |
a |
9.781 Å |
b |
9.778 Å |
c |
9.815 Å |
α |
90° |
β |
90° |
γ |
90° |
Cell volume |
938.693 Å3 |
Number of distinct elements |
2 |
Space group number |
61 |
Hermann-Mauguin space group symbol |
P b c a |
Hall space group symbol |
-P 2ac 2ab |
Yes |
No |
No |