Information card for entry 9014542
Mineral name |
Betpakdalite-CaMg |
Formula |
As2 Ca1.928 Fe3 H48.352 Mg Mo8 Na0.072 O61.176 |
Calculated formula |
As2 Ca1.928 Fe3 H48.352 Mg Mo8 Na0.072 O61.176 |
Title of publication |
The heteropolymolybdate family: structural relations, nomenclature scheme and new species |
Authors of publication |
Kampf, A. R.; Mills, S. J.; Rumsey, M. S.; Dini, M.; Birch, W. D.; Spratt, J.; Pluth, J. J.; Steele, I. M.; Jenkins, R. A.; Pinch, W. W. |
Journal of publication |
Mineralogical Magazine |
Year of publication |
2012 |
Journal volume |
76 |
Pages of publication |
1175 - 1207 |
a |
19.5336 Å |
b |
11.0637 Å |
c |
15.2559 Å |
α |
90° |
β |
131.528° |
γ |
90° |
Cell volume |
2468.25 Å3 |
Number of distinct elements |
8 |
Space group number |
12 |
Hermann-Mauguin space group symbol |
C 1 2/m 1 |
Hall space group symbol |
-C 2y |
Yes |
No |
No |