Information card for entry 9014799
Mineral name |
Nisnite |
Formula |
Ni3 Sn |
Calculated formula |
Ni3 Sn |
Title of publication |
Nisnite, Ni3Sn, a new nickel mineral species from the Jeffrey mine, Asbestos, Quebec |
Authors of publication |
Rowe, R.; Grice, J. D.; Poirier, G.; Stanley, C. J.; Horvath, L. |
Journal of publication |
The Canadian Mineralogist |
Year of publication |
2011 |
Journal volume |
49 |
Pages of publication |
651 - 656 |
a |
3.7349 Å |
b |
3.7349 Å |
c |
3.7349 Å |
α |
90° |
β |
90° |
γ |
90° |
Cell volume |
52.1 Å3 |
Number of distinct elements |
2 |
Space group number |
221 |
Hermann-Mauguin space group symbol |
P m -3 m |
Hall space group symbol |
-P 4 2 3 |
Yes |
No |
No |