Information card for entry 9014916
Mineral name
Olenite
Formula
Al7.407 B3 Ca0.032 F0.48 Fe0.018 H3.33 K0.004 Li0.483 Mn1.143 Na0.773 O30.52 Si5.826 Ti0.006
Calculated formula
Al7.407 B3 Ca0.032 F0.48 Fe0.018 H3.33 K0.004 Li0.483 Mn1.143 Na0.773 O30.52 Si5.826 Ti0.006
Title of publication
Mn-rich tourmaline from Austria: structure, chemistry, optical spectra, and relations to synthetic solid solutions Note: This sample may be named wrong Sample P6
Authors of publication
Ertl, A.; Hughes, J. M.; Prowatke, S.; Rossman, G. R.; London, D.; Fritz, E. A.
Journal of publication
American Mineralogist
Year of publication
2003
Journal volume
88
Pages of publication
1369 - 1376
a
15.941 Å
b
15.941 Å
c
7.136 Å
α
90°
β
90°
γ
120°
Cell volume
1570.42 Å3
Number of distinct elements
13
Space group number
160
Hermann-Mauguin space group symbol
R 3 m :H
Hall space group symbol
R 3 -2"
Yes
No
No