Information card for entry 9015101
Formula |
La O3 Pt0.501 Zn0.501 |
Calculated formula |
La O3 Pt0.5 Zn0.5 |
Title of publication |
New ordered and distorted perovskites: the mixed platinates Ln2 M Pt O6 (Ln = La, Pr, Nd, Sm, Eu, Gd; M = Mg, Co, Ni, Zn) _cod_database_code 1001825 |
Authors of publication |
Ouchetto, K.; Archaimbault, F.; Choisnet, J.; Et-Tabirou M |
Journal of publication |
Materials Chemistry and Physics |
Year of publication |
1997 |
Journal volume |
51 |
Pages of publication |
117 - 124 |
a |
5.5944 Å |
b |
5.6879 Å |
c |
7.9351 Å |
α |
90° |
β |
90° |
γ |
90° |
Cell volume |
252.498 Å3 |
Number of distinct elements |
4 |
Space group number |
14 |
Hermann-Mauguin space group symbol |
P 1 21/n 1 |
Hall space group symbol |
-P 2yn |
Duplicate of |
Yes |
No |
No |