Information card for entry 9016138
Mineral name |
Ringwoodite |
Formula |
Mg1.88 O4 Si0.98 |
Calculated formula |
Mg1.88 O4 Si0.98 |
Title of publication |
Compressibility and thermal expansion of hydrous ringwoodite with 2.5(3) wt% H2O Note: T = 586 K |
Authors of publication |
Ye, Y.; Brown, D. A.; Smyth, J. R.; Panero, W. R.; Jacobsen, S. D.; Chang, Y. Y.; Townsend, J. P.; Thomas, S. M.; Hauri, E. H.; Dera, P.; Frost, D. J. |
Journal of publication |
American Mineralogist |
Year of publication |
2012 |
Journal volume |
97 |
Pages of publication |
573 - 582 |
a |
8.1084 Å |
b |
8.1084 Å |
c |
8.1084 Å |
α |
90° |
β |
90° |
γ |
90° |
Cell volume |
533.096 Å3 |
Number of distinct elements |
3 |
Space group number |
227 |
Hermann-Mauguin space group symbol |
F d -3 m :2 |
Hall space group symbol |
-F 4vw 2vw 3 |
Yes |
No |
No |