Information card for entry 9016635
Mineral name |
Iron |
Formula |
Fe |
Calculated formula |
Fe |
SMILES |
[Fe] |
Title of publication |
Isothermal compression of face-centered cubic iron Note: gamma iron, Sample M622, P = 19.82 GPa, T = 1073 K |
Authors of publication |
Nishihara, Y.; Nakajima, Y.; Akashi, A.; Tsujino, N.; Takahashi, E.; Funakoshi, K.; Higo, Y. |
Journal of publication |
American Mineralogist |
Year of publication |
2012 |
Journal volume |
97 |
Pages of publication |
1417 - 1420 |
a |
3.495 Å |
b |
3.495 Å |
c |
3.495 Å |
α |
90° |
β |
90° |
γ |
90° |
Cell volume |
42.692 Å3 |
Number of distinct elements |
1 |
Space group number |
225 |
Hermann-Mauguin space group symbol |
F m -3 m |
Hall space group symbol |
-F 4 2 3 |
Yes |
No |
No |