Information card for entry 9016937
Mineral name |
Bairdite |
Formula |
Cu2 H2 O8.5 Pb0.999 S0.5 Te |
Calculated formula |
Cu2 H2 O8.5 Pb0.999 S0.5 Te |
Title of publication |
Lead-tellurium oxysalts from Otto Mountain near Baker, California: X. Bairdite, Pb2Cu2+4Te6+2O10(OH)2(SO4)(H2O), a new mineral with thick HCP layers |
Authors of publication |
Kampf, A. R.; Mills, S. J.; Housley, R. M.; Rossman, G. R.; Marty, J.; Thorne, B. |
Journal of publication |
American Mineralogist |
Year of publication |
2013 |
Journal volume |
98 |
Pages of publication |
1315 - 1321 |
a |
14.3126 Å |
b |
5.2267 Å |
c |
9.4878 Å |
α |
90° |
β |
106.815° |
γ |
90° |
Cell volume |
679.414 Å3 |
Number of distinct elements |
6 |
Space group number |
14 |
Hermann-Mauguin space group symbol |
P 1 21/c 1 |
Hall space group symbol |
-P 2ybc |
Yes |
No |
No |