Information card for entry 9017485
Mineral name |
Gurimite |
Formula |
Ba1.5 O8 Sr1.5 V2 |
Calculated formula |
Ba1.5 O8 Sr1.5 V2 |
Title of publication |
Crystal chemistry, Rietveld refinements and Raman spectroscopy studies of the new solid solution series: Ba3-xSrx(VO4)2 (0<=x<=3) Note: x = 1.5 |
Authors of publication |
Azdouz, M.; Manoun, B.; Essehli, R.; Azrour, M.; Bih, L.; Benmokhtar, S.; Ait Hou, A.; Lazor, P. |
Journal of publication |
Journal of Alloys and Compounds |
Year of publication |
2010 |
Journal volume |
498 |
Pages of publication |
42 - 51 |
a |
5.7084 Å |
b |
5.7084 Å |
c |
20.6912 Å |
α |
90° |
β |
90° |
γ |
120° |
Cell volume |
583.909 Å3 |
Number of distinct elements |
4 |
Space group number |
166 |
Hermann-Mauguin space group symbol |
R -3 m :H |
Hall space group symbol |
-R 3 2" |
Yes |
No |
No |