Information card for entry 9017487
Formula |
Ba0.5 O8 Sr2.5 V2 |
Calculated formula |
Ba0.5 O8 Sr2.5 V2 |
Title of publication |
Crystal chemistry, Rietveld refinements and Raman spectroscopy studies of the new solid solution series: Ba3-xSrx(VO4)2 (0<=x<=3) Note: x = 2.5 |
Authors of publication |
Azdouz, M.; Manoun, B.; Essehli, R.; Azrour, M.; Bih, L.; Benmokhtar, S.; Ait Hou, A.; Lazor, P. |
Journal of publication |
Journal of Alloys and Compounds |
Year of publication |
2010 |
Journal volume |
498 |
Pages of publication |
42 - 51 |
a |
5.6498 Å |
b |
5.6498 Å |
c |
20.2789 Å |
α |
90° |
β |
90° |
γ |
120° |
Cell volume |
560.585 Å3 |
Number of distinct elements |
4 |
Space group number |
166 |
Hermann-Mauguin space group symbol |
R -3 m :H |
Hall space group symbol |
-R 3 2" |
Yes |
No |
No |