Information card for entry 1523019
Formula |
Fe2 Yb |
Calculated formula |
Fe2 Yb |
Title of publication |
New phases melt quenched under high pressure in R-Fe systemes (R= Pr, Sm, Dy, Tb, Ho, Er, Tm, Yb, Lu) |
Authors of publication |
Tsvyashchenko, A.V.; Popova, S.V. |
Journal of publication |
Journal of the Less-Common Metals |
Year of publication |
1985 |
Journal volume |
108 |
Pages of publication |
115 - 121 |
a |
7.231 Å |
b |
7.231 Å |
c |
7.231 Å |
α |
90° |
β |
90° |
γ |
90° |
Cell volume |
378.09 Å3 |
Number of distinct elements |
2 |
Space group number |
227 |
Hermann-Mauguin space group symbol |
F d -3 m :1 |
Hall space group symbol |
F 4d 2 3 -1d |
Yes |
No |
No |