Information card for entry 1523020
Chemical name |
(Fe Yb)1.5 |
Formula |
Fe1.5 Yb1.5 |
Calculated formula |
Fe1.50067 Yb1.49933 |
Title of publication |
New phases melt quenched under high pressure in R-Fe systemes (R= Pr, Sm, Dy, Tb, Ho, Er, Tm, Yb, Lu) |
Authors of publication |
Tsvyashchenko, A.V.; Popova, S.V. |
Journal of publication |
Journal of the Less-Common Metals |
Year of publication |
1985 |
Journal volume |
108 |
Pages of publication |
115 - 121 |
a |
5.272 Å |
b |
5.272 Å |
c |
8.487 Å |
α |
90° |
β |
90° |
γ |
120° |
Cell volume |
204.285 Å3 |
Number of distinct elements |
2 |
Space group number |
194 |
Hermann-Mauguin space group symbol |
P 63/m m c |
Hall space group symbol |
-P 6c 2c |
Yes |
No |
No |