Information card for entry 1524937
Chemical name |
Th3 Rh4 Sn13 |
Formula |
Rh4 Sn13 Th3 |
Calculated formula |
Rh4 Sn13 Th3 |
Title of publication |
Nature of the structural distortion and of the chemical bonding in Sn M3 Rh4 Sn12 (M= La - Gd, Yb, Ca, Sr and Th) |
Authors of publication |
Miraglia, S.; Hodeau, J.L.; Ghedira, M.; Marezio, M.; Laviron, C.; Espinosa, G.P. |
Journal of publication |
Journal of Solid State Chemistry |
Year of publication |
1986 |
Journal volume |
53 |
Pages of publication |
358 - 368 |
a |
9.692 Å |
b |
9.692 Å |
c |
9.692 Å |
α |
90° |
β |
90° |
γ |
90° |
Cell volume |
910.417 Å3 |
Number of distinct elements |
3 |
Space group number |
223 |
Hermann-Mauguin space group symbol |
P m -3 n |
Hall space group symbol |
-P 4n 2 3 |
Yes |
No |
No |