Information card for entry 1524938
Formula |
Eu3 Rh4 Sn13 |
Calculated formula |
Eu3 Rh4 Sn13 |
Title of publication |
Nature of the structural distortion and of the chemical bonding in Sn M3 Rh4 Sn12 (M= La - Gd, Yb, Ca, Sr and Th) |
Authors of publication |
Miraglia, S.; Hodeau, J.L.; Marezio, M.; Ghedira, M.; Laviron, C.; Espinosa, G.P. |
Journal of publication |
Journal of Solid State Chemistry |
Year of publication |
1986 |
Journal volume |
53 |
Pages of publication |
358 - 368 |
a |
9.749 Å |
b |
9.749 Å |
c |
9.749 Å |
α |
90° |
β |
90° |
γ |
90° |
Cell volume |
926.574 Å3 |
Number of distinct elements |
3 |
Space group number |
223 |
Hermann-Mauguin space group symbol |
P m -3 n |
Hall space group symbol |
-P 4n 2 3 |
Yes |
No |
No |