Information card for entry 1528762
Chemical name |
D Nd Ti O4 |
Formula |
D Nd O4 Ti |
Calculated formula |
D Nd O4 Ti |
Title of publication |
Structural change in a series of protonated layered perovskite compounds, H Ln Ti O4 (Ln = La, Nd and Y) |
Authors of publication |
Nishimoto, S.; Ishigaki, T.; Harjo, S.; Matsuda, M.; Kamiyama, T.; Hoshikawa, A.; Miyake, M. |
Journal of publication |
Journal of Solid State Chemistry |
Year of publication |
2006 |
Journal volume |
179 |
Pages of publication |
1892 - 1897 |
a |
3.7039 Å |
b |
3.7039 Å |
c |
12.0883 Å |
α |
90° |
β |
90° |
γ |
90° |
Cell volume |
165.838 Å3 |
Number of distinct elements |
4 |
Space group number |
129 |
Hermann-Mauguin space group symbol |
P 4/n m m :1 |
Hall space group symbol |
P 4ab 2ab -1ab |
Yes |
No |
No |