Information card for entry 1528763
Chemical name |
D Y (Ti O4) |
Formula |
D O4 Ti Y |
Calculated formula |
D0.999 O4 Ti Y |
Title of publication |
Structural change in a series of protonated layered perovskite compounds, H Ln Ti O4 (Ln= La, Nd and Y) |
Authors of publication |
Nishimoto, S.; Hoshikawa, A.; Harjo, S.; Matsuda, M.; Kamiyama, T.; Ishigaki, T.; Miyake, M. |
Journal of publication |
Journal of Solid State Chemistry |
Year of publication |
2006 |
Journal volume |
179 |
Pages of publication |
1892 - 1897 |
a |
11.46 Å |
b |
5.292 Å |
c |
5.3628 Å |
α |
90° |
β |
90.441° |
γ |
90° |
Cell volume |
325.224 Å3 |
Number of distinct elements |
4 |
Space group number |
14 |
Hermann-Mauguin space group symbol |
P 1 21/c 1 |
Hall space group symbol |
-P 2ybc |
Yes |
No |
No |