Information card for entry 1529328
Formula | C27 H34.5 F9 N7.5 O9 P S3 |
Calculated formula | C25 H31.5 F9 N6.5 O9 P S3 |
Title of publication | Bipyridine complexes of E3+(E = P, As, Sb, Bi): strong Lewis acids, sources of E(OTf)3and synthons for EIand EVcations |
Authors of publication | Chitnis, Saurabh S.; Robertson, Alasdair P. M.; Burford, Neil; Patrick, Brian O.; McDonald, Robert; Ferguson, Michael J. |
Journal of publication | Chem. Sci. |
Year of publication | 2015 |
Journal volume | 6 |
Journal issue | 11 |
Pages of publication | 6545 |
a | 13.2699 ± 0.0007 Å |
b | 15.788 ± 0.0008 Å |
c | 20.4958 ± 0.001 Å |
α | 76.0415 ± 0.0007° |
β | 87.922 ± 0.0007° |
γ | 73.566 ± 0.0007° |
Cell volume | 3994.6 ± 0.4 Å3 |
Cell temperature | 193 ± 2 K |
Ambient diffraction temperature | 193 ± 2 K |
Number of distinct elements | 7 |
Space group number | 2 |
Hermann-Mauguin space group symbol | P -1 |
Hall space group symbol | -P 1 |
Residual factor for all reflections | 0.0746 |
Residual factor for significantly intense reflections | 0.0544 |
Weighted residual factors for significantly intense reflections | 0.1577 |
Weighted residual factors for all reflections included in the refinement | 0.1744 |
Goodness-of-fit parameter for all reflections included in the refinement | 1.087 |
Diffraction radiation wavelength | 0.71073 Å |
Diffraction radiation type | MoKα |