Information card for entry 1532467
Formula |
C11 H7 F2 N3 O3 S |
Calculated formula |
C11 H7 F2 N3 O3 S |
Title of publication |
A minimalist fluorescent probe for differentiating Cys, Hcy and GSH in live cells |
Authors of publication |
Zhang, Huatang; Liu, Ruochuan; Liu, Jie; Li, Lin; Wang, Ping; Yao, Shao Q.; Xu, Zhengtao; Sun, Hongyan |
Journal of publication |
Chem. Sci. |
Year of publication |
2016 |
Journal volume |
7 |
Journal issue |
1 |
Pages of publication |
256 |
a |
26.261 ± 0.003 Å |
b |
5.162 ± 0.0004 Å |
c |
9.7804 ± 0.001 Å |
α |
90° |
β |
111.188 ± 0.012° |
γ |
90° |
Cell volume |
1236.2 ± 0.2 Å3 |
Cell temperature |
173 ± 2 K |
Ambient diffraction temperature |
173 ± 2 K |
Number of distinct elements |
6 |
Space group number |
5 |
Hermann-Mauguin space group symbol |
C 1 2 1 |
Hall space group symbol |
C 2y |
Residual factor for all reflections |
0.0308 |
Residual factor for significantly intense reflections |
0.0293 |
Weighted residual factors for significantly intense reflections |
0.0848 |
Weighted residual factors for all reflections included in the refinement |
0.0857 |
Goodness-of-fit parameter for all reflections included in the refinement |
1.088 |
Diffraction radiation wavelength |
1.54178 Å |
Diffraction radiation type |
CuKα |
Yes |
No |
No |