Information card for entry 1532468
Formula | C82 H116 Cd2 N24 O25 |
Calculated formula | C48 H24 Cd2 N12 O12 |
Title of publication | Metal‒organic framework composites with luminescent gold(iii) complexes. Strongly emissive and long-lived excited states in open air and photo-catalysis |
Authors of publication | Sun, Chun-Yi; To, Wai-Pong; Wang, Xin-Long; Chan, Kaai-Tung; Su, Zhong-Min; Che, Chi-Ming |
Journal of publication | Chem. Sci. |
Year of publication | 2015 |
Journal volume | 6 |
Journal issue | 12 |
Pages of publication | 7105 |
a | 30.664 ± 0.005 Å |
b | 17.225 ± 0.005 Å |
c | 27.371 ± 0.005 Å |
α | 90 ± 0.005° |
β | 105.9 ± 0.005° |
γ | 90 ± 0.005° |
Cell volume | 13904 ± 5 Å3 |
Cell temperature | 293 ± 2 K |
Ambient diffraction temperature | 293 ± 2 K |
Number of distinct elements | 5 |
Space group number | 15 |
Hermann-Mauguin space group symbol | C 1 2/c 1 |
Hall space group symbol | -C 2yc |
Residual factor for all reflections | 0.1411 |
Residual factor for significantly intense reflections | 0.0723 |
Weighted residual factors for significantly intense reflections | 0.1556 |
Weighted residual factors for all reflections included in the refinement | 0.1677 |
Goodness-of-fit parameter for all reflections included in the refinement | 1.044 |
Diffraction radiation wavelength | 0.71069 Å |
Diffraction radiation type | MoKα |