Information card for entry 1533253
Chemical name |
Ru Sr2 Y (Cu2 O7.76) |
Formula |
Cu2 O7.76 Ru Sr2 Y |
Calculated formula |
Cu2 O7.76 Ru Sr2 Y |
Title of publication |
A systematic study on the crystal structure and properties of Ru Sr2 R Cu2 O8-d (R = Gd, Tb, Dy, Y, Ho, Er) |
Authors of publication |
Yang, L.T.; Rao, G.H.; Liu, Q.L.; Liang, J.K.; Jin, C.Q.; Song, G.B.; Feng, X.M.; Liu, F.S.; Luo, J. |
Journal of publication |
Journal of Solid State Chemistry |
Year of publication |
2004 |
Journal volume |
177 |
Pages of publication |
1072 - 1077 |
a |
3.8275 Å |
b |
3.8275 Å |
c |
11.5326 Å |
α |
90° |
β |
90° |
γ |
90° |
Cell volume |
168.95 Å3 |
Number of distinct elements |
5 |
Space group number |
123 |
Hermann-Mauguin space group symbol |
P 4/m m m |
Hall space group symbol |
-P 4 2 |
Yes |
No |
No |