Information card for entry 1533254
Chemical name |
Ru Sr2 Er (Cu2 O7.84) |
Formula |
Cu2 Er O7.84 Ru Sr2 |
Calculated formula |
Cu2 Er O7.84 Ru Sr2 |
Title of publication |
A systematic study on the crystal structure and properties of Ru Sr2 R Cu2 O8-d (R = Gd, Tb, Dy, Y, Ho, Er) |
Authors of publication |
Yang, L.T.; Liang, J.K.; Liu, Q.L.; Jin, C.Q.; Feng, X.M.; Rao, G.H.; Song, G.B.; Luo, J.; Liu, F.S. |
Journal of publication |
Journal of Solid State Chemistry |
Year of publication |
2004 |
Journal volume |
177 |
Pages of publication |
1072 - 1077 |
a |
3.8209 Å |
b |
3.8209 Å |
c |
11.5155 Å |
α |
90° |
β |
90° |
γ |
90° |
Cell volume |
168.118 Å3 |
Number of distinct elements |
5 |
Space group number |
123 |
Hermann-Mauguin space group symbol |
P 4/m m m |
Hall space group symbol |
-P 4 2 |
Yes |
No |
No |