Information card for entry 1545053
Formula |
Al Ti |
Calculated formula |
Al Ti |
Title of publication |
Hydrostatic Compression Behavior and High-Pressure Stabilized β-Phase in γ-Based Titanium Aluminide Intermetallics |
Authors of publication |
Liss, Klaus-Dieter; Funakoshi, Ken-Ichi; Dippenaar, Rian; Higo, Yuji; Shiro, Ayumi; Reid, Mark; Suzuki, Hiroshi; Shobu, Takahisa; Akita, Koichi |
Journal of publication |
Metals |
Year of publication |
2016 |
Journal volume |
6 |
Journal issue |
7 |
Pages of publication |
165 |
a |
4.01867 Å |
b |
4.01867 Å |
c |
4.06542 Å |
α |
90° |
β |
90° |
γ |
90° |
Cell volume |
65.655 Å3 |
Cell temperature |
300 K |
Cell measurement pressure |
100 kPa |
Number of distinct elements |
2 |
Space group number |
123 |
Hermann-Mauguin space group symbol |
P 4/m m m |
Hall space group symbol |
-P 4 2 |
Yes |
No |
No |