Information card for entry 1545054
Formula |
Al Ti3 |
Calculated formula |
Al Ti3 |
Title of publication |
Hydrostatic Compression Behavior and High-Pressure Stabilized β-Phase in γ-Based Titanium Aluminide Intermetallics |
Authors of publication |
Liss, Klaus-Dieter; Funakoshi, Ken-Ichi; Dippenaar, Rian; Higo, Yuji; Shiro, Ayumi; Reid, Mark; Suzuki, Hiroshi; Shobu, Takahisa; Akita, Koichi |
Journal of publication |
Metals |
Year of publication |
2016 |
Journal volume |
6 |
Journal issue |
7 |
Pages of publication |
165 |
a |
5.76803 Å |
b |
5.76803 Å |
c |
4.64241 Å |
α |
90° |
β |
90° |
γ |
120° |
Cell volume |
133.761 Å3 |
Cell temperature |
300 K |
Cell measurement pressure |
100 kPa |
Number of distinct elements |
2 |
Space group number |
194 |
Hermann-Mauguin space group symbol |
P 63/m m c |
Hall space group symbol |
-P 6c 2c |
Yes |
No |
No |