Information card for entry 1550352
Formula | C22 H18 Ag Cl N6 O6 |
Calculated formula | C22 H18 Ag Cl N6 O6 |
Title of publication | Infinite coordination polymer networks: metallogelation of aminopyridine conjugates and in situ silver nanoparticle formation. |
Authors of publication | Tatikonda, Rajendhraprasad; Bulatov, Evgeny; Özdemir, Zülal; Nonappa, ?; Haukka, Matti |
Journal of publication | Soft matter |
Year of publication | 2019 |
Journal volume | 15 |
Journal issue | 3 |
Pages of publication | 442 - 451 |
a | 11.3109 ± 0.0003 Å |
b | 14.7646 ± 0.0003 Å |
c | 13.9188 ± 0.0003 Å |
α | 90° |
β | 105.464 ± 0.003° |
γ | 90° |
Cell volume | 2240.3 ± 0.09 Å3 |
Cell temperature | 120 K |
Ambient diffraction temperature | 120 K |
Number of distinct elements | 6 |
Space group number | 14 |
Hermann-Mauguin space group symbol | P 1 21/n 1 |
Hall space group symbol | -P 2yn |
Residual factor for all reflections | 0.0324 |
Residual factor for significantly intense reflections | 0.0269 |
Weighted residual factors for significantly intense reflections | 0.0559 |
Weighted residual factors for all reflections included in the refinement | 0.058 |
Goodness-of-fit parameter for all reflections included in the refinement | 1.088 |
Diffraction radiation probe | x-ray |
Diffraction radiation wavelength | 0.71073 Å |
Diffraction radiation type | MoKα |