Information card for entry 1550353
Formula | C28 H30 N8 O4 |
Calculated formula | C28 H30 N8 O4 |
SMILES | O=C(Nc1ccncc1)c1ccnc(c1)c1nccc(c1)C(=O)Nc1ccncc1.O=CN(C)C.O=CN(C)C |
Title of publication | Infinite coordination polymer networks: metallogelation of aminopyridine conjugates and in situ silver nanoparticle formation. |
Authors of publication | Tatikonda, Rajendhraprasad; Bulatov, Evgeny; Özdemir, Zülal; Nonappa, ?; Haukka, Matti |
Journal of publication | Soft matter |
Year of publication | 2019 |
Journal volume | 15 |
Journal issue | 3 |
Pages of publication | 442 - 451 |
a | 19.2704 ± 0.0006 Å |
b | 4.05485 ± 0.00013 Å |
c | 33.1511 ± 0.001 Å |
α | 90° |
β | 92.289 ± 0.003° |
γ | 90° |
Cell volume | 2588.31 ± 0.14 Å3 |
Cell temperature | 120 ± 0.1 K |
Ambient diffraction temperature | 120 ± 0.1 K |
Number of distinct elements | 4 |
Space group number | 15 |
Hermann-Mauguin space group symbol | C 1 2/c 1 |
Hall space group symbol | -C 2yc |
Residual factor for all reflections | 0.0489 |
Residual factor for significantly intense reflections | 0.0459 |
Weighted residual factors for significantly intense reflections | 0.1133 |
Weighted residual factors for all reflections included in the refinement | 0.1153 |
Goodness-of-fit parameter for all reflections included in the refinement | 1.07 |
Diffraction radiation probe | x-ray |
Diffraction radiation wavelength | 0.71073 Å |
Diffraction radiation type | MoKα |