Information card for entry 1555088
Formula | C26 H20 Cl F3 N2 O2 |
Calculated formula | C26 H20 Cl F3 N2 O2 |
SMILES | c1cc(ccc1)c1ccc(cc1)n1c(c2ccc(cc2)Cl)nc(c1CC(F)(F)F)C(=O)OCC |
Title of publication | A rhodium-catalyzed three-component reaction of arylisocyanides, trifluorodiazoethane, and activated methylene isocyanides or azomethine ylides: an efficient synthesis of trifluoroethyl-substituted imidazoles |
Authors of publication | Yu, Yang; Zhang, Yan; Wang, Zhuo; Liang, Yong-Xin; Zhao, Yu-Long |
Journal of publication | Organic Chemistry Frontiers |
Year of publication | 2019 |
Journal volume | 6 |
Journal issue | 21 |
Pages of publication | 3657 |
a | 7.2179 ± 0.001 Å |
b | 17.509 ± 0.002 Å |
c | 18.867 ± 0.003 Å |
α | 90° |
β | 100.172 ± 0.008° |
γ | 90° |
Cell volume | 2346.9 ± 0.6 Å3 |
Cell temperature | 293 ± 2 K |
Ambient diffraction temperature | 293 ± 2 K |
Number of distinct elements | 6 |
Space group number | 9 |
Hermann-Mauguin space group symbol | C 1 c 1 |
Hall space group symbol | C -2yc |
Residual factor for all reflections | 0.0619 |
Residual factor for significantly intense reflections | 0.042 |
Weighted residual factors for significantly intense reflections | 0.0952 |
Weighted residual factors for all reflections included in the refinement | 0.1026 |
Goodness-of-fit parameter for all reflections included in the refinement | 1.091 |
Diffraction radiation wavelength | 1.54178 Å |
Diffraction radiation type | CuKα |