Information card for entry 1560848
Formula | C34 H46 Cl Ge N P Si |
Calculated formula | C34 H46 Cl Ge N P Si |
SMILES | [Ge]1(Cl)[P](c2ccccc2)(C[Si](N1c1c(C(C)C)cccc1C(C)C)(C(C)C)C(C)C)c1ccccc1 |
Title of publication | Reversible metathesis of ammonia in an acyclic germylene‒Ni0 complex |
Authors of publication | Keil, Philip M.; Szilvási, Tibor; Hadlington, Terrance J. |
Journal of publication | Chemical Science |
Year of publication | 2021 |
Journal volume | 12 |
Journal issue | 15 |
Pages of publication | 5582 - 5590 |
a | 15.55 ± 0.003 Å |
b | 19.91 ± 0.004 Å |
c | 21.82 ± 0.004 Å |
α | 90° |
β | 95.6 ± 0.03° |
γ | 90° |
Cell volume | 6723 ± 2 Å3 |
Cell temperature | 150 ± 2 K |
Ambient diffraction temperature | 150 ± 2 K |
Number of distinct elements | 7 |
Space group number | 14 |
Hermann-Mauguin space group symbol | P 1 21/c 1 |
Hall space group symbol | -P 2ybc |
Residual factor for all reflections | 0.1437 |
Residual factor for significantly intense reflections | 0.057 |
Weighted residual factors for significantly intense reflections | 0.0974 |
Weighted residual factors for all reflections included in the refinement | 0.1237 |
Goodness-of-fit parameter for all reflections included in the refinement | 1.01 |
Diffraction radiation wavelength | 0.71073 Å |
Diffraction radiation type | MoKα |