Information card for entry 1560849
Formula | C73 H71 Ge N2 Ni P3 Si |
Calculated formula | C73 H71 Ge N2 Ni P3 Si |
SMILES | [Ge]1([Ni]([P](c2ccccc2)(c2ccccc2)C[Si](N1c1c(C(C)C)cccc1C(C)C)(c1ccccc1)c1ccccc1)([P](c1ccccc1)(c1ccccc1)c1ccccc1)[P](c1ccccc1)(c1ccccc1)c1ccccc1)N |
Title of publication | Reversible metathesis of ammonia in an acyclic germylene‒Ni0 complex |
Authors of publication | Keil, Philip M.; Szilvási, Tibor; Hadlington, Terrance J. |
Journal of publication | Chemical Science |
Year of publication | 2021 |
Journal volume | 12 |
Journal issue | 15 |
Pages of publication | 5582 - 5590 |
a | 12.18 ± 0.002 Å |
b | 13.55 ± 0.003 Å |
c | 20.86 ± 0.004 Å |
α | 75.1 ± 0.03° |
β | 88.3 ± 0.03° |
γ | 70.4 ± 0.03° |
Cell volume | 3128.1 ± 1.3 Å3 |
Cell temperature | 150 ± 2 K |
Ambient diffraction temperature | 150 ± 2 K |
Number of distinct elements | 7 |
Space group number | 2 |
Hermann-Mauguin space group symbol | P -1 |
Hall space group symbol | -P 1 |
Residual factor for all reflections | 0.0582 |
Residual factor for significantly intense reflections | 0.0364 |
Weighted residual factors for significantly intense reflections | 0.0831 |
Weighted residual factors for all reflections included in the refinement | 0.0912 |
Goodness-of-fit parameter for all reflections included in the refinement | 1.016 |
Diffraction radiation wavelength | 0.71073 Å |
Diffraction radiation type | MoKα |