Information card for entry 1561003
Formula | C25 H51 N3 O23 V6 |
Calculated formula | C25 H51 N3 O23 V6 |
Title of publication | Physicochemical implications of surface alkylation of high-valent, Lindqvist-type polyoxovanadate-alkoxide clusters. |
Authors of publication | Fertig, Alex A.; Rabbani, S. M. Gulam; Koch, Melissa D.; Brennessel, William W.; Miró, Pere; Matson, Ellen M. |
Journal of publication | Nanoscale |
Year of publication | 2021 |
Journal volume | 13 |
Journal issue | 12 |
Pages of publication | 6162 - 6173 |
a | 13.8593 ± 0.0001 Å |
b | 17.3129 ± 0.0001 Å |
c | 17.6954 ± 0.0001 Å |
α | 90° |
β | 100.618 ± 0.001° |
γ | 90° |
Cell volume | 4173.22 ± 0.05 Å3 |
Cell temperature | 100 ± 0.1 K |
Ambient diffraction temperature | 100 ± 0.1 K |
Number of distinct elements | 5 |
Space group number | 14 |
Hermann-Mauguin space group symbol | P 1 21/n 1 |
Hall space group symbol | -P 2yn |
Residual factor for all reflections | 0.0668 |
Residual factor for significantly intense reflections | 0.0645 |
Weighted residual factors for significantly intense reflections | 0.1586 |
Weighted residual factors for all reflections included in the refinement | 0.16 |
Goodness-of-fit parameter for all reflections included in the refinement | 1.136 |
Diffraction radiation probe | x-ray |
Diffraction radiation wavelength | 1.54184 Å |
Diffraction radiation type | CuKα |