Information card for entry 1561004
Formula | C27 H57 O19 P V6 |
Calculated formula | C27 H57 O19 P V6 |
Title of publication | Physicochemical implications of surface alkylation of high-valent, Lindqvist-type polyoxovanadate-alkoxide clusters. |
Authors of publication | Fertig, Alex A.; Rabbani, S. M. Gulam; Koch, Melissa D.; Brennessel, William W.; Miró, Pere; Matson, Ellen M. |
Journal of publication | Nanoscale |
Year of publication | 2021 |
Journal volume | 13 |
Journal issue | 12 |
Pages of publication | 6162 - 6173 |
a | 13.0905 ± 0.0004 Å |
b | 16.6569 ± 0.0005 Å |
c | 18.2558 ± 0.0005 Å |
α | 90° |
β | 92.394 ± 0.003° |
γ | 90° |
Cell volume | 3977.2 ± 0.2 Å3 |
Cell temperature | 100 ± 0.1 K |
Ambient diffraction temperature | 100 ± 0.1 K |
Number of distinct elements | 5 |
Space group number | 15 |
Hermann-Mauguin space group symbol | C 1 2/c 1 |
Hall space group symbol | -C 2yc |
Residual factor for all reflections | 0.0554 |
Residual factor for significantly intense reflections | 0.0472 |
Weighted residual factors for significantly intense reflections | 0.1379 |
Weighted residual factors for all reflections included in the refinement | 0.1444 |
Goodness-of-fit parameter for all reflections included in the refinement | 1.072 |
Diffraction radiation probe | x-ray |
Diffraction radiation wavelength | 1.54184 Å |
Diffraction radiation type | CuKα |