Information card for entry 1561077
Formula | C15 H14 N2 O2 S |
Calculated formula | C15 H14 N2 O2 S |
SMILES | s1c2c(cccc2)[nH+]c1N.[O-]C(=O)c1cccc(c1)C |
Title of publication | Role of S…O non-bonded interaction in controlling supramolecular assemblies in a new series of 2-aminobenzothiazole based organic salts/ co-crystals |
Authors of publication | Yadav, Priyanka; Patel, Vatsa; Ballabh, Amar |
Journal of publication | Journal of Solid State Chemistry |
Year of publication | 2018 |
Journal volume | 263 |
Pages of publication | 231 - 238 |
a | 11.559 ± 0.0007 Å |
b | 10.7188 ± 0.0005 Å |
c | 12.1113 ± 0.0007 Å |
α | 90° |
β | 113.798 ± 0.007° |
γ | 90° |
Cell volume | 1372.99 ± 0.15 Å3 |
Cell temperature | 293 K |
Ambient diffraction temperature | 293 K |
Number of distinct elements | 5 |
Space group number | 14 |
Hermann-Mauguin space group symbol | P 1 21/c 1 |
Hall space group symbol | -P 2ybc |
Residual factor for all reflections | 0.0464 |
Residual factor for significantly intense reflections | 0.038 |
Weighted residual factors for significantly intense reflections | 0.0988 |
Weighted residual factors for all reflections included in the refinement | 0.1064 |
Goodness-of-fit parameter for all reflections included in the refinement | 0.866 |
Diffraction radiation probe | x-ray |
Diffraction radiation wavelength | 0.71073 Å |
Diffraction radiation type | MoKα |
Diffraction radiation X-ray symbol | Mo |