Information card for entry 1561078
Formula | C15 H14 N2 O2 S |
Calculated formula | C15 H14 N2 O2 S |
SMILES | s1c(nc2c1cccc2)N.OC(=O)c1ccc(cc1)C |
Title of publication | Role of S…O non-bonded interaction in controlling supramolecular assemblies in a new series of 2-aminobenzothiazole based organic salts/ co-crystals |
Authors of publication | Yadav, Priyanka; Patel, Vatsa; Ballabh, Amar |
Journal of publication | Journal of Solid State Chemistry |
Year of publication | 2018 |
Journal volume | 263 |
Pages of publication | 231 - 238 |
a | 8.66534 ± 0.00017 Å |
b | 8.26694 ± 0.00013 Å |
c | 19.7644 ± 0.0003 Å |
α | 90° |
β | 91.4732 ± 0.0015° |
γ | 90° |
Cell volume | 1415.37 ± 0.04 Å3 |
Cell temperature | 293 K |
Ambient diffraction temperature | 293 K |
Number of distinct elements | 5 |
Space group number | 14 |
Hermann-Mauguin space group symbol | P 1 21/c 1 |
Hall space group symbol | -P 2ybc |
Residual factor for all reflections | 0.0482 |
Residual factor for significantly intense reflections | 0.0462 |
Weighted residual factors for significantly intense reflections | 0.1255 |
Weighted residual factors for all reflections included in the refinement | 0.1281 |
Goodness-of-fit parameter for all reflections included in the refinement | 1.043 |
Diffraction radiation probe | x-ray |
Diffraction radiation wavelength | 1.54184 Å |
Diffraction radiation type | CuKα |
Diffraction radiation X-ray symbol | Mo |