Information card for entry 1562534
Formula | C26 H15 Er N2 O10 |
Calculated formula | C26 H15 Er N2 O10 |
Title of publication | Lanthanide coordination polymers based on multi-donor ligand containing pyridine and phthalate moieties: Structures, luminescence and magnetic properties |
Authors of publication | Feng, Xun; Liu, Lang; Wang, Li-Ya; Song, Hong-Liang; Qiang Shi, Zhi; Wu, Xu-Hong; Ng, Seik-Weng |
Journal of publication | Journal of Solid State Chemistry |
Year of publication | 2013 |
Journal volume | 206 |
Pages of publication | 277 - 285 |
a | 7.635 ± 0.0004 Å |
b | 10.6255 ± 0.0005 Å |
c | 14.3727 ± 0.0008 Å |
α | 75.6702 ± 0.0007° |
β | 84.5632 ± 0.0008° |
γ | 75.8766 ± 0.0007° |
Cell volume | 1094.84 ± 0.1 Å3 |
Cell temperature | 293 ± 2 K |
Ambient diffraction temperature | 293 ± 2 K |
Number of distinct elements | 5 |
Space group number | 2 |
Hermann-Mauguin space group symbol | P -1 |
Hall space group symbol | -P 1 |
Residual factor for all reflections | 0.0257 |
Residual factor for significantly intense reflections | 0.0244 |
Weighted residual factors for significantly intense reflections | 0.0678 |
Weighted residual factors for all reflections included in the refinement | 0.0689 |
Goodness-of-fit parameter for all reflections included in the refinement | 1.017 |
Diffraction radiation wavelength | 0.71073 Å |
Diffraction radiation type | MoKα |